{"text_format":"1","workbook":"xlsx","n_sheets":3,"sheets":["Calculations","UserInterface","Start"],"not_rendered":{"charts":0,"images":2,"macros":1,"external_links":0,"defined_names":1,"comments":0,"pivot_tables":0},"unopened":[],"bounds":{"document_bytes":16777216,"sheet_cells":100000,"rows_first":2000,"rows_last":500,"rows_between":2000,"halvings":0,"cell_chars":16384,"cell_head_chars":4096},"cells_cut":0,"cells_raw":0,"read":"whole","date_system":"1900"}

{"sheet":"Calculations","index":0,"n_rows":23,"n_cols":12,"rows_kept":23,"cut":false,"hidden":true,"merged":[[12,7,12,8],[0,7,0,11],[0,1,1,2],[1,10,1,11]]}
[null,"Bandwidth ",null,null,null,null,null,"Sensor Parameters"]
[null,null,null,null,null,null,null,null,null,null,"1H period [us] per bitness"]
[null,"Protocol","Bandwidth (Gbps)",null,"Bitness",null,"Camera Model","Sensor Type","Width","Height",10,12]
[null,"CXP3",2.5,null,10,null,"IRON 462","IMX462",1920,1080,7.4,14.8]
[null,"CXP6",4.9000000000000004,null,12]
[null,"CXP12",9.8000000000000007]
[null,"CLHS",9.8000000000000007]
[null,"10GIGE Vision",9.8000000000000007]
[]
[null,null,null,null,null,null,null,"Max Width of Selected Sensor:",{"$f":"VLOOKUP(UserInterface!B19,Calculations!G4:I8,3,FALSE)","v":1920}]
[null,null,null,null,null,null,null,"Max Height of Selected Sensor:",{"$f":"VLOOKUP(UserInterface!B19,Calculations!G4:J8,4,FALSE)","v":1080}]
[]
[null,null,null,null,null,null,null,"Calculation"]
[null,null,null,null,null,null,null,"WINWV_OB",12]
[null,null,null,null,null,null,null,"V_max",1125]
[null,null,null,null,null,null,null,"V_TTL",{"$f":"I15-1080+UserInterface!D21","v":1125}]
[null,null,null,null,null,null,null,"1H Period",{"$f":"HLOOKUP(UserInterface!D23,Calculations!G3:L4,2,FALSE)/(1000000)","v":7.4000000000000003E-6}]
[null,null,null,null,null,null,null,"Sensor fps",{"$f":"1/(I16*I17)","v":120.12012012012011}]
[null,null,null,null,null,null,null,"Protocol efficiency [%]",0.95]
[null,null,null,null,null,null,null,"Protocol bandwidth",{"$f":"VLOOKUP(UserInterface!D24,Calculations!B4:C8,2,FALSE)*I19*1000000000","v":4655000000}]
[null,null,null,null,null,null,null,"Frame bandwidth",{"$f":"UserInterface!D21*UserInterface!D22*UserInterface!D23","v":20736000}]
[null,null,null,null,null,null,null,"Protocol limited fps",{"$f":"I20/I21","v":224.48881172839506}]
[null,null,null,null,null,null,null,"FPS",{"$f":"ROUND(MIN(I22,I18),2)","v":120.12}]

{"sheet":"UserInterface","index":1,"n_rows":25,"n_cols":4,"rows_kept":25,"cut":false,"hidden":true,"merged":[[18,0,19,0],[6,1,6,2],[13,1,16,4],[18,1,19,1],[3,1,5,4],[22,3,22,4],[23,3,23,4],[24,3,24,4],[24,1,24,2],[20,1,20,2],[21,1,21,2],[22,1,22,2],[23,1,23,2],[20,3,20,4],[21,3,21,4]]}
[]
[]
[]
[null,"IRON 462"]
[]
[]
[null,"Frame-Rate Calculator"]
[]
[]
[]
[]
[]
[]
[null,"This document is provided as a simple and convinent tool for our customers to use. Please feel free to contact our support team with any questions - we will be happy to  provide assitance and support! For more information, products and the latest updates visit our website,  www.KayaInstruments.com"]
[]
[]
[]
[]
[null,"IRON 462"]
[null,null,{"$f":"VLOOKUP(B19,Calculations!G4:J8,4,FALSE)&\" (V) x \"&VLOOKUP(B19,Calculations!G4:J8,3,FALSE)&\" (H)\"","v":"1080 (V) x 1920 (H)"}]
[null,"Number of Desired lines (V)",null,1080]
[null,"Desired Number of Horizontal Pixels (H)",null,1920]
[null,"Bitness Selection:",null,10]
[null,"Interface Selection:",null,"CXP6"]
[null,"MAX Frame Rate: ",null,{"$f":"Calculations!I23","v":120.12}]

{"sheet":"Start","index":2,"n_rows":18,"n_cols":2,"rows_kept":18,"cut":false,"hidden":false,"merged":[[17,1,17,4]]}
[]
[]
[]
[]
[]
[]
[]
[]
[]
[]
[]
[]
[]
[]
[]
[]
[]
[null,"You must enable macros in order to use this calculator!"]