{"text_format":"1","workbook":"xlsx","n_sheets":3,"sheets":["Calculations","UserInterface","Start"],"not_rendered":{"charts":0,"images":3,"macros":1,"external_links":0,"defined_names":3,"comments":0,"pivot_tables":0},"unopened":[],"bounds":{"document_bytes":16777216,"sheet_cells":100000,"rows_first":2000,"rows_last":500,"rows_between":2000,"halvings":0,"cell_chars":16384,"cell_head_chars":4096},"cells_cut":0,"cells_raw":0,"read":"whole","date_system":"1900"}

{"sheet":"Calculations","index":0,"n_rows":37,"n_cols":16,"rows_kept":37,"cut":false,"hidden":true,"merged":[[0,1,0,2],[0,4,0,6]]}
[null,"Bandwidth ",null,null,"Max Frame Rate Calculation"]
[null,"Protocol","Bandwidth (Gbps)",null,"Parameter","Value","Remark"]
[null,"CXP3",2.4,null,"Bandwidth",{"$f":"VLOOKUP(UserInterface!$D$30,Calculations!$B$3:$C$5,2,FALSE)*(100-$C$6)/100","v":9.8000000000000007}]
[null,"CXP6",4.9000000000000004,null,"# of links",{"$f":"UserInterface!D28","v":2}]
[null,"CXP12",9.8000000000000007,null,"Total Bandwidth",{"$f":"F3*F4*1000000000","v":19600000000}]
[null,"Overhead (%)",0,null,"CLK_PIX (Hz)",{"$f":"VLOOKUP($C$9,$E$30:$P$37,8,FALSE)","v":80000000},"Sensor Clock - Pre defined"]
[null,null,null,null,"CLK_PIX Period (s)",{"$f":"1/F6","v":1.2499999999999999E-8},"TCLK_PIX"]
[null,null,null,null,"LVDS Lines ",{"$f":"VLOOKUP($C$9,$E$30:$P$37,6,FALSE)","v":16}]
[null,"Sensor select",{"$f":"CONCATENATE(UserInterface!$B$23,\" \",UserInterface!$D$25)","v":"Iron 0505 Normal Speed"},null,"LVDS Lines Total",{"$f":"VLOOKUP($C$9,$E$30:$P$37,7,FALSE)","v":48}]
[null,"Bitness",8,null,"Readout Black Lines",{"$f":"VLOOKUP($C$9,$E$30:$P$37,2,FALSE)-VLOOKUP($C$9,$E$30:$P$37,4,FALSE) + 14","v":14}]
[null,null,10,null,"Lines",{"$f":"UserInterface!$D$26","v":5120},"NROW"]
[null,null,{"$f":"IF(UserInterface!$D$25=\"Normal Speed\",\"12\",\"\")","v":"12"},null,"Columns",{"$f":"UserInterface!$D$27","v":5120}]
[null,"Height",{"$f":"VLOOKUP($C$9,$E$30:$P$37,4,FALSE)","v":5120},null,"Readout Bits (8,10,12)",{"$f":"UserInterface!$D$29","v":12}]
[null,"Width",{"$f":"VLOOKUP($C$9,$E$30:$P$37,5,FALSE)","v":5120},null,"Line Size (Bits)",{"$f":"F12*F13","v":61440}]
[null,"Links",1,null,"Line Rate (Hz)",{"$f":"F5/F14","v":319010.41666666669}]
[null,null,2,null,"Shortes sensor line time (s)",{"$f":"1/F15","v":3.1346938775510203E-6}]
[null,null,{"$f":"IF(UserInterface!$D$25=\"High Speed\",\"4\",\"\")","v":""},null,"Shortest line time (clocks)",{"$f":"F16*F8/(F9*F7)","v":83.591836734693885},"LINE_U_LENGTH (From protocol)"]
[null,null,null,null,"Shortest sensor line times",{"$f":"VLOOKUP($C$9,$E$30:$P$37,9,FALSE)","v":124}]
[null,null,null,null,"LINE_U_LENGTH register",{"$f":"CEILING(MAX(F18,ROUNDUP(F17,0)),4)","v":124}]
[null,null,null,null,"Actual line time",{"$f":"F19*F9/F8*F7","v":4.6499999999999995E-6}]
[null,null,null,null,"TFOT",{"$f":"VLOOKUP($C$9,$E$30:$P$37,11,FALSE)*F19*F7","v":9.299999999999999E-6}]
[null,null,null,null,"TRD",{"$f":"(F11+F10+(VLOOKUP($C$9,$E$30:$P$37,12,FALSE)))*F20","v":2.3882399999999998E-2}]
[null,null,null,null,"TFRM (Min)",{"$f":"F21+F22","v":2.3891699999999998E-2}]
[]
[null,null,null,null,"Max FPS",{"$f":"1/F23","v":41.855539789968901}]
[]
[]
[]
[null,"Sensor",null,null,"Sensor","Sensor Height (V)","Sensor Width (H)","Max Height (V)","Max Width (H)","Multiplexer CH","Multiplexer CH Total","Sensor Clock","min line duration","min exposure ticks","fps_line_duration_factor","fps_min_line_count"]
[null,"Iron 0505",null,null,"Iron 0505 Normal Speed",5120,5376,5120,5120,16,48,80000000,124,636,6,2]
[null,"Iron 2505",null,null,"Iron 0505 High Speed",5120,5376,5120,5120,48,48,96000000,124,742,7,10]
[null,"Iron 2509",null,null,"Iron 2505 Normal Speed",2160,2800,2160,2600,10,20,80000000,152,119,1,6]
[null,"Iron 2518",null,null,"Iron 2505 High Speed",2160,2800,2160,2600,20,20,96000000,152,119,1,6]
[null,null,null,null,"Iron 2509 Normal Speed",2160,4480,2160,4200,16,32,80000000,152,119,1,6]
[null,null,null,null,"Iron 2509 High Speed",2160,4480,2160,4200,32,32,96000000,152,119,1,6]
[null,null,null,null,"Iron 2518 Normal Speed",4096,4736,4096,4508,16,32,80000000,152,636,6,8]
[null,null,null,null,"Iron 2518 High Speed",4096,4736,4096,4508,32,32,96000000,152,636,6,15]

{"sheet":"UserInterface","index":1,"n_rows":31,"n_cols":4,"rows_kept":31,"cut":false,"hidden":true,"merged":[[30,3,30,4],[30,1,30,2],[24,1,24,2],[26,1,26,2],[28,1,28,2],[29,1,29,2],[24,3,24,4],[26,3,26,4],[27,1,27,2],[27,3,27,4],[25,1,25,2],[25,3,25,4],[22,0,23,0],[28,3,28,4],[29,3,29,4],[3,1,5,2],[6,1,6,2],[14,1,17,4],[22,1,23,1],[19,1,20,2],[21,1,21,4]]}
[]
[]
[]
[null,"IRON x5xx"]
[]
[]
[null,"Frame-Rate Calculator"]
[]
[]
[]
[]
[]
[]
[]
[null,"This document is provided as a simple and convinent tool for our customers to use. Please feel free to contact our support team with any questions - we will be happy to  provide assitance and support! For more information, products and the latest updates visit our website,  www.KayaInstruments.com"]
[]
[]
[]
[]
[null,"Camera Selector"]
[]
[null," Select a camera model from the drop-down menu below:"]
["Selector u","Iron 0505"]
[null,null,{"$f":"Calculations!C13&\" (V) x \"&Calculations!C14&\" (H)\"","v":"5120 (V) x 5120 (H)"}]
[null,"Mode Selection",null,"Normal Speed"]
[null,"Number of Desired lines (V)",null,5120]
[null,"Desired Number of Horizontal Pixels (H)",null,5120]
[null,"Number of Links",null,2]
[null,"Bitness Selection:",null,12]
[null,"Interface Selection:",null,"CXP12"]
[null,"MAX Frame Rate: ",null,{"$f":"Calculations!F25","v":41.855539789968901}]

{"sheet":"Start","index":2,"n_rows":18,"n_cols":2,"rows_kept":18,"cut":false,"hidden":false,"merged":[[17,1,17,4]]}
[]
[]
[]
[]
[]
[]
[]
[]
[]
[]
[]
[]
[]
[]
[]
[]
[]
[null,"You must enable macros in order to use this calculator!"]