{"text_format":"1","workbook":"xlsx","n_sheets":3,"sheets":["Calculations","UserInterface","Start"],"not_rendered":{"charts":0,"images":3,"macros":1,"external_links":0,"defined_names":1,"comments":0,"pivot_tables":0},"unopened":[],"bounds":{"document_bytes":16777216,"sheet_cells":100000,"rows_first":2000,"rows_last":500,"rows_between":2000,"halvings":0,"cell_chars":16384,"cell_head_chars":4096},"cells_cut":0,"cells_raw":0,"read":"whole","date_system":"1900"}

{"sheet":"Calculations","index":0,"n_rows":32,"n_cols":10,"rows_kept":32,"cut":false,"hidden":true,"merged":[[30,4,30,7],[31,4,31,7],[9,1,9,7],[11,4,11,7],[12,4,12,7],[13,4,13,7],[14,4,14,7],[26,1,26,2],[26,4,26,7],[10,1,10,2],[10,4,10,7],[15,4,15,7],[16,4,16,7],[31,1,31,2],[23,1,23,2],[30,1,30,2],[22,1,22,2],[22,4,22,7],[24,1,24,2],[24,4,24,7],[25,1,25,2],[25,4,25,7],[23,4,23,7],[27,1,27,2],[27,4,27,7],[28,1,28,2],[28,4,28,7],[29,4,29,7],[29,1,29,2],[19,1,19,2],[20,1,20,2],[21,1,21,2],[15,1,15,2],[16,1,16,2],[17,1,17,2],[18,1,18,2],[17,4,17,7],[18,4,18,7],[20,4,20,7],[19,4,19,7],[21,4,21,7],[0,1,0,3],[11,1,11,2],[12,1,12,2],[14,1,14,2],[13,1,13,2]]}
[null,"Bandwidth "]
[null,"Protocol","Bandwidth (Gbps)","Rate Multiplier",null,"Bitns (NS)","Bitns (HS)",null,"Sensor Width",9344]
[null,"CXP3",2.5,1,null,8,8,null,"Sensor Height",7000]
[null,"CXP6",4.9000000000000004,2,null,10,10]
[null,"CXP12",9.8000000000000007,4,null,12,null,null,"Modes"]
[null,null,null,null,null,null,null,null,"High Speed"]
[null,"Overhead (%)",5,null,null,null,null,null,"Normal Speed"]
[]
[]
[null,"Max Frame Rate Calculation"]
[null,"Parameter",null,"Value","Remark"]
[null,"Bandwidth",null,{"$f":"C3*(100-C7)/100","v":2.375}]
[null,"# of links",null,{"$f":"UserInterface!D22","v":1}]
[null,"Rate Multiplier",null,{"$f":"VLOOKUP(UserInterface!D26,Calculations!B2:D5,3,FALSE)","v":4}]
[null,"Total Bandwidth",null,{"$f":"D12*D13*D14*1000000000","v":9500000000}]
[null,"CLK_PIX (Hz)",null,{"$f":"IF(UserInterface!D21=\"Normal Speed\",80000000,90000000)","v":90000000},"Sensor Clock - Pre defined"]
[null,"CLK_PIX Period (s)",null,{"$f":"1/D16","v":1.1111111111111112E-8},"TCLK_PIX"]
[null,"LVDS Lines ",null,{"$f":"IF(UserInterface!D21=\"Normal Speed\",28,56)","v":56},"(56,28) HS/NS"]
[null,"Lines",null,{"$f":"UserInterface!D23","v":7000},"NROW"]
[null,"Columns",null,{"$f":"UserInterface!D24","v":9344}]
[null,"Readout Bits (8,10,12)",null,{"$f":"UserInterface!D25","v":8},"NS supports all , HS only 10 and 12"]
[null,"Line Size (Bits)",null,{"$f":"D20*D21","v":74752}]
[null,"Line Rate (Hz)",null,{"$f":"D15/D22","v":127086.9006849315}]
[null,"Shortes sensor line time (s)",null,{"$f":"1/D23","v":7.8686315789473677E-6}]
[null,"Shortest line time (clocks)",null,{"$f":"D24*D18/(56*D17)","v":708.17684210526306}]
[null,"Shortest sensor line times",null,180]
[null,"LINE_U_LENGTH register",null,{"$f":"MAX(D26,ROUNDUP(D25,0))","v":709}]
[null,"Actual line time",null,{"$f":"D27*56*D17/D18","v":7.8777777777777782E-6}]
[null,"TFOT",null,{"$f":"6*D27*D17","v":4.7266666666666673E-5}]
[null,"TRD",null,{"$f":"(D19+10)*D28","v":5.5223222222222222E-2}]
[null,"TFRM (Min)",null,{"$f":"D29+D30","v":5.5270488888888886E-2}]
[null,"Max FPS",null,{"$f":"1/D31","v":18.092837970192654}]

{"sheet":"UserInterface","index":1,"n_rows":27,"n_cols":4,"rows_kept":27,"cut":false,"hidden":true,"merged":[[18,0,19,0],[21,1,21,2],[21,3,21,4],[24,3,24,4],[25,3,25,4],[20,1,20,2],[20,3,20,4],[3,1,5,2],[6,1,6,2],[14,1,17,4],[18,1,19,1],[26,3,26,4],[26,1,26,2],[22,1,22,2],[23,1,23,2],[24,1,24,2],[25,1,25,2],[22,3,22,4],[23,3,23,4]]}
[]
[]
[]
[null,"IRON"]
[]
[]
[null,"Frame-Rate Calculator"]
[]
[]
[]
[]
[]
[]
[]
[null,"This document is provided as a simple and convinent tool for our customers to use. Please feel free to contact our support team with any questions - we will be happy to  provide assitance and support! For more information, products and the latest updates visit our website,  www.KayaInstruments.com"]
[]
[]
[]
[null,"Iron 3265"]
[null,null,{"$f":"Calculations!J3&\" (V) x \"&Calculations!J2&\" (H)\"","v":"7000 (V) x 9344 (H)"}]
[null,"Mode Selection",null,"High Speed"]
[null,"Number of Links",null,1]
[null,"Number of Desired lines (V)",null,7000]
[null,"Desired Number of Horizontal Pixels (H)",null,9344]
[null,"Bitness Selection:",null,8]
[null,"Interface Selection:",null,"CXP12"]
[null,"MAX Frame Rate: ",null,{"$f":"ROUND(Calculations!D32,1)","v":18.100000000000001}]

{"sheet":"Start","index":2,"n_rows":18,"n_cols":2,"rows_kept":18,"cut":false,"hidden":false,"merged":[[17,1,17,4]]}
[]
[]
[]
[]
[]
[]
[]
[]
[]
[]
[]
[]
[]
[]
[]
[]
[]
[null,"You must enable macros in order to use this calculator!"]